{"text_format":"1","workbook":"xlsx","n_sheets":6,"sheets":["INSTRUCTIONS","1 - H&S Risk Assessment","2 - Inventory Log","3 - Security Risk Assessment","4 - Software Install Log","Lookup"],"not_rendered":{"charts":0,"images":0,"macros":1,"external_links":0,"defined_names":72,"comments":0,"pivot_tables":0},"unopened":[],"bounds":{"document_bytes":16777216,"sheet_cells":100000,"rows_first":2000,"rows_last":500,"rows_between":2000,"halvings":0,"cell_chars":16384,"cell_head_chars":4096},"cells_cut":0,"cells_raw":0,"read":"whole","date_system":"1900"}

{"sheet":"INSTRUCTIONS","index":0,"n_rows":4,"n_cols":4,"rows_kept":4,"cut":false,"hidden":false,"merged":[[1,0,1,2],[2,0,2,2],[3,0,3,2],[0,0,0,2],[0,3,0,7],[1,3,1,7],[2,3,2,7],[3,3,3,7]]}
["Workbook ID: ",null,null,"DSS-007-01"]
["Student First Name: "]
["Student Surname: "]
["Student ID: "]

{"sheet":"1 - H&S Risk Assessment","index":1,"n_rows":10,"n_cols":7,"rows_kept":10,"cut":false,"hidden":false,"merged":[[0,0,0,6],[1,4,2,6]]}
["Health and Safety Risk Assessment"]
["Company name:      ",null,"Assessment carried out by:      "]
["Date of next review:      ",null,"Date assessment was carried out:      "]
["What are the hazards?","Who might be harmed and how?","What are you already doing to control the risks?","What further action do you need to take to control the risks?","Who needs to carry out the action?","When is the action needed by?","Done"]
["     ","     ","     ","     ","     ","     ","     "]
["     ","     ","     ","     ","     ","     ","     "]
["     ","     ","     ","     ","     ","     ","     "]
["     ","     ","     ","     ","     ","     ","     "]
["     ","     ","     ","     ","     ","     ","     "]
["     ","     ","     ","     ","     ","     ","     "]

{"sheet":"2 - Inventory Log","index":2,"n_rows":124,"n_cols":5,"rows_kept":124,"cut":false,"hidden":false,"merged":[]}
["Device Type","Device Name","IP Assignment Method","IP Address","Notes"]
["Desktop","PC1","DHCP",{"$f":"IF(C2=\"\",\"\",IF(C2=\"DHCP\",\"Auto Assigned\",\"\"))","v":"Auto Assigned"},"Example data, delete this row before completing"]
[null,null,null,{"$f":"IF(C3=\"\",\"\",IF(C3=\"DHCP\",\"Auto Assigned\",\"\"))","v":""}]
[null,null,null,""]
[null,null,null,""]
[null,null,null,""]
[null,null,null,""]
[null,null,null,""]
[null,null,null,""]
[null,null,null,""]
[null,null,null,""]
[null,null,null,""]
[null,null,null,""]
[null,null,null,""]
[null,null,null,""]
[null,null,null,""]
[null,null,null,""]
[null,null,null,""]
[null,null,null,""]
[null,null,null,""]
[null,null,null,""]
[null,null,null,""]
[null,null,null,""]
[null,null,null,""]
[null,null,null,""]
[null,null,null,""]
[null,null,null,""]
[null,null,null,""]
[null,null,null,""]
[null,null,null,""]
[null,null,null,""]
[null,null,null,""]
[null,null,null,""]
[null,null,null,""]
[null,null,null,""]
[null,null,null,""]
[null,null,null,""]
[null,null,null,""]
[null,null,null,""]
[null,null,null,""]
[null,null,null,""]
[null,null,null,""]
[null,null,null,""]
[null,null,null,""]
[null,null,null,""]
[null,null,null,""]
[null,null,null,""]
[null,null,null,""]
[null,null,null,""]
[null,null,null,""]
[null,null,null,""]
[null,null,null,""]
[null,null,null,""]
[null,null,null,""]
[null,null,null,""]
[null,null,null,""]
[null,null,null,""]
[null,null,null,""]
[null,null,null,""]
[null,null,null,""]
[null,null,null,""]
[null,null,null,""]
[null,null,null,""]
[null,null,null,""]
[null,null,null,""]
[null,null,null,""]
[null,null,null,{"$f":"IF(C67=\"\",\"\",IF(C67=\"DHCP\",\"Auto Assigned\",\"\"))","v":""}]
[null,null,null,""]
[null,null,null,""]
[null,null,null,""]
[null,null,null,""]
[null,null,null,""]
[null,null,null,""]
[null,null,null,""]
[null,null,null,""]
[null,null,null,""]
[null,null,null,""]
[null,null,null,""]
[null,null,null,""]
[null,null,null,""]
{"$rows_left_out":45}
{"sheet":"3 - Security Risk Assessment","index":3,"n_rows":201,"n_cols":12,"rows_kept":201,"cut":false,"hidden":false,"merged":[[0,10,1,10],[0,11,1,11],[0,0,0,2],[0,3,0,6],[0,8,1,8],[0,9,1,9]]}
["RISK REGISTER",null,null,"Risk Rating",null,null,null,null,"Date Raised","Raised By","Owner","Notes"]
["ID","Status","Description","Probability","Impact","Proximity","Rating","Proposed Mitigation Action(s)"]
["R1","Open","EXAMPLE LINE ","Likely","High","< 2 weeks",27,"Delete this line before completing","2026-01-01","JB","JB"]
["R2",null,null,null,null,null,{"$f":"IF(D4=\"\",\"\",(VLOOKUP(D4,Lookup!$E$3:$F$22,2,FALSE)*VLOOKUP(E4,Lookup!$G$3:$H$22,2,FALSE)+VLOOKUP(F4,Lookup!$I$3:$J$22,2,FALSE)))","v":""}]
["R3",null,null,null,null,null,{"$f":"IF(D5=\"\",\"\",(VLOOKUP(D5,Lookup!$E$3:$F$22,2,FALSE)*VLOOKUP(E5,Lookup!$G$3:$H$22,2,FALSE)+VLOOKUP(F5,Lookup!$I$3:$J$22,2,FALSE)))","v":""}]
["R4",null,null,null,null,null,{"$f":"IF(D6=\"\",\"\",(VLOOKUP(D6,Lookup!$E$3:$F$22,2,FALSE)*VLOOKUP(E6,Lookup!$G$3:$H$22,2,FALSE)+VLOOKUP(F6,Lookup!$I$3:$J$22,2,FALSE)))","v":""}]
["R5",null,null,null,null,null,{"$f":"IF(D7=\"\",\"\",(VLOOKUP(D7,Lookup!$E$3:$F$22,2,FALSE)*VLOOKUP(E7,Lookup!$G$3:$H$22,2,FALSE)+VLOOKUP(F7,Lookup!$I$3:$J$22,2,FALSE)))","v":""}]
["R6",null,null,null,null,null,{"$f":"IF(D8=\"\",\"\",(VLOOKUP(D8,Lookup!$E$3:$F$22,2,FALSE)*VLOOKUP(E8,Lookup!$G$3:$H$22,2,FALSE)+VLOOKUP(F8,Lookup!$I$3:$J$22,2,FALSE)))","v":""}]
["R7",null,null,null,null,null,{"$f":"IF(D9=\"\",\"\",(VLOOKUP(D9,Lookup!$E$3:$F$22,2,FALSE)*VLOOKUP(E9,Lookup!$G$3:$H$22,2,FALSE)+VLOOKUP(F9,Lookup!$I$3:$J$22,2,FALSE)))","v":""}]
["R8",null,null,null,null,null,{"$f":"IF(D10=\"\",\"\",(VLOOKUP(D10,Lookup!$E$3:$F$22,2,FALSE)*VLOOKUP(E10,Lookup!$G$3:$H$22,2,FALSE)+VLOOKUP(F10,Lookup!$I$3:$J$22,2,FALSE)))","v":""}]
["R9",null,null,null,null,null,{"$f":"IF(D11=\"\",\"\",(VLOOKUP(D11,Lookup!$E$3:$F$22,2,FALSE)*VLOOKUP(E11,Lookup!$G$3:$H$22,2,FALSE)+VLOOKUP(F11,Lookup!$I$3:$J$22,2,FALSE)))","v":""}]
["R10",null,null,null,null,null,{"$f":"IF(D12=\"\",\"\",(VLOOKUP(D12,Lookup!$E$3:$F$22,2,FALSE)*VLOOKUP(E12,Lookup!$G$3:$H$22,2,FALSE)+VLOOKUP(F12,Lookup!$I$3:$J$22,2,FALSE)))","v":""}]
["R11",null,null,null,null,null,{"$f":"IF(D13=\"\",\"\",(VLOOKUP(D13,Lookup!$E$3:$F$22,2,FALSE)*VLOOKUP(E13,Lookup!$G$3:$H$22,2,FALSE)+VLOOKUP(F13,Lookup!$I$3:$J$22,2,FALSE)))","v":""}]
["R12",null,null,null,null,null,{"$f":"IF(D14=\"\",\"\",(VLOOKUP(D14,Lookup!$E$3:$F$22,2,FALSE)*VLOOKUP(E14,Lookup!$G$3:$H$22,2,FALSE)+VLOOKUP(F14,Lookup!$I$3:$J$22,2,FALSE)))","v":""}]
["R13",null,null,null,null,null,{"$f":"IF(D15=\"\",\"\",(VLOOKUP(D15,Lookup!$E$3:$F$22,2,FALSE)*VLOOKUP(E15,Lookup!$G$3:$H$22,2,FALSE)+VLOOKUP(F15,Lookup!$I$3:$J$22,2,FALSE)))","v":""}]
["R14",null,null,null,null,null,{"$f":"IF(D16=\"\",\"\",(VLOOKUP(D16,Lookup!$E$3:$F$22,2,FALSE)*VLOOKUP(E16,Lookup!$G$3:$H$22,2,FALSE)+VLOOKUP(F16,Lookup!$I$3:$J$22,2,FALSE)))","v":""}]
["R15",null,null,null,null,null,{"$f":"IF(D17=\"\",\"\",(VLOOKUP(D17,Lookup!$E$3:$F$22,2,FALSE)*VLOOKUP(E17,Lookup!$G$3:$H$22,2,FALSE)+VLOOKUP(F17,Lookup!$I$3:$J$22,2,FALSE)))","v":""}]
["R16",null,null,null,null,null,{"$f":"IF(D18=\"\",\"\",(VLOOKUP(D18,Lookup!$E$3:$F$22,2,FALSE)*VLOOKUP(E18,Lookup!$G$3:$H$22,2,FALSE)+VLOOKUP(F18,Lookup!$I$3:$J$22,2,FALSE)))","v":""}]
["R17",null,null,null,null,null,{"$f":"IF(D19=\"\",\"\",(VLOOKUP(D19,Lookup!$E$3:$F$22,2,FALSE)*VLOOKUP(E19,Lookup!$G$3:$H$22,2,FALSE)+VLOOKUP(F19,Lookup!$I$3:$J$22,2,FALSE)))","v":""}]
["R18",null,null,null,null,null,{"$f":"IF(D20=\"\",\"\",(VLOOKUP(D20,Lookup!$E$3:$F$22,2,FALSE)*VLOOKUP(E20,Lookup!$G$3:$H$22,2,FALSE)+VLOOKUP(F20,Lookup!$I$3:$J$22,2,FALSE)))","v":""}]
["R19",null,null,null,null,null,{"$f":"IF(D21=\"\",\"\",(VLOOKUP(D21,Lookup!$E$3:$F$22,2,FALSE)*VLOOKUP(E21,Lookup!$G$3:$H$22,2,FALSE)+VLOOKUP(F21,Lookup!$I$3:$J$22,2,FALSE)))","v":""}]
["R20",null,null,null,null,null,{"$f":"IF(D22=\"\",\"\",(VLOOKUP(D22,Lookup!$E$3:$F$22,2,FALSE)*VLOOKUP(E22,Lookup!$G$3:$H$22,2,FALSE)+VLOOKUP(F22,Lookup!$I$3:$J$22,2,FALSE)))","v":""}]
["R21",null,null,null,null,null,{"$f":"IF(D23=\"\",\"\",(VLOOKUP(D23,Lookup!$E$3:$F$22,2,FALSE)*VLOOKUP(E23,Lookup!$G$3:$H$22,2,FALSE)+VLOOKUP(F23,Lookup!$I$3:$J$22,2,FALSE)))","v":""}]
["R22",null,null,null,null,null,{"$f":"IF(D24=\"\",\"\",(VLOOKUP(D24,Lookup!$E$3:$F$22,2,FALSE)*VLOOKUP(E24,Lookup!$G$3:$H$22,2,FALSE)+VLOOKUP(F24,Lookup!$I$3:$J$22,2,FALSE)))","v":""}]
["R23",null,null,null,null,null,{"$f":"IF(D25=\"\",\"\",(VLOOKUP(D25,Lookup!$E$3:$F$22,2,FALSE)*VLOOKUP(E25,Lookup!$G$3:$H$22,2,FALSE)+VLOOKUP(F25,Lookup!$I$3:$J$22,2,FALSE)))","v":""}]
["R24",null,null,null,null,null,{"$f":"IF(D26=\"\",\"\",(VLOOKUP(D26,Lookup!$E$3:$F$22,2,FALSE)*VLOOKUP(E26,Lookup!$G$3:$H$22,2,FALSE)+VLOOKUP(F26,Lookup!$I$3:$J$22,2,FALSE)))","v":""}]
["R25",null,null,null,null,null,{"$f":"IF(D27=\"\",\"\",(VLOOKUP(D27,Lookup!$E$3:$F$22,2,FALSE)*VLOOKUP(E27,Lookup!$G$3:$H$22,2,FALSE)+VLOOKUP(F27,Lookup!$I$3:$J$22,2,FALSE)))","v":""}]
["R26",null,null,null,null,null,{"$f":"IF(D28=\"\",\"\",(VLOOKUP(D28,Lookup!$E$3:$F$22,2,FALSE)*VLOOKUP(E28,Lookup!$G$3:$H$22,2,FALSE)+VLOOKUP(F28,Lookup!$I$3:$J$22,2,FALSE)))","v":""}]
["R27",null,null,null,null,null,{"$f":"IF(D29=\"\",\"\",(VLOOKUP(D29,Lookup!$E$3:$F$22,2,FALSE)*VLOOKUP(E29,Lookup!$G$3:$H$22,2,FALSE)+VLOOKUP(F29,Lookup!$I$3:$J$22,2,FALSE)))","v":""}]
["R28",null,null,null,null,null,{"$f":"IF(D30=\"\",\"\",(VLOOKUP(D30,Lookup!$E$3:$F$22,2,FALSE)*VLOOKUP(E30,Lookup!$G$3:$H$22,2,FALSE)+VLOOKUP(F30,Lookup!$I$3:$J$22,2,FALSE)))","v":""}]
["R29",null,null,null,null,null,{"$f":"IF(D31=\"\",\"\",(VLOOKUP(D31,Lookup!$E$3:$F$22,2,FALSE)*VLOOKUP(E31,Lookup!$G$3:$H$22,2,FALSE)+VLOOKUP(F31,Lookup!$I$3:$J$22,2,FALSE)))","v":""}]
["R30",null,null,null,null,null,{"$f":"IF(D32=\"\",\"\",(VLOOKUP(D32,Lookup!$E$3:$F$22,2,FALSE)*VLOOKUP(E32,Lookup!$G$3:$H$22,2,FALSE)+VLOOKUP(F32,Lookup!$I$3:$J$22,2,FALSE)))","v":""}]
["R31",null,null,null,null,null,{"$f":"IF(D33=\"\",\"\",(VLOOKUP(D33,Lookup!$E$3:$F$22,2,FALSE)*VLOOKUP(E33,Lookup!$G$3:$H$22,2,FALSE)+VLOOKUP(F33,Lookup!$I$3:$J$22,2,FALSE)))","v":""}]
["R32",null,null,null,null,null,{"$f":"IF(D34=\"\",\"\",(VLOOKUP(D34,Lookup!$E$3:$F$22,2,FALSE)*VLOOKUP(E34,Lookup!$G$3:$H$22,2,FALSE)+VLOOKUP(F34,Lookup!$I$3:$J$22,2,FALSE)))","v":""}]
["R33",null,null,null,null,null,{"$f":"IF(D35=\"\",\"\",(VLOOKUP(D35,Lookup!$E$3:$F$22,2,FALSE)*VLOOKUP(E35,Lookup!$G$3:$H$22,2,FALSE)+VLOOKUP(F35,Lookup!$I$3:$J$22,2,FALSE)))","v":""}]
["R34",null,null,null,null,null,{"$f":"IF(D36=\"\",\"\",(VLOOKUP(D36,Lookup!$E$3:$F$22,2,FALSE)*VLOOKUP(E36,Lookup!$G$3:$H$22,2,FALSE)+VLOOKUP(F36,Lookup!$I$3:$J$22,2,FALSE)))","v":""}]
["R35",null,null,null,null,null,{"$f":"IF(D37=\"\",\"\",(VLOOKUP(D37,Lookup!$E$3:$F$22,2,FALSE)*VLOOKUP(E37,Lookup!$G$3:$H$22,2,FALSE)+VLOOKUP(F37,Lookup!$I$3:$J$22,2,FALSE)))","v":""}]
["R36",null,null,null,null,null,{"$f":"IF(D38=\"\",\"\",(VLOOKUP(D38,Lookup!$E$3:$F$22,2,FALSE)*VLOOKUP(E38,Lookup!$G$3:$H$22,2,FALSE)+VLOOKUP(F38,Lookup!$I$3:$J$22,2,FALSE)))","v":""}]
["R37",null,null,null,null,null,{"$f":"IF(D39=\"\",\"\",(VLOOKUP(D39,Lookup!$E$3:$F$22,2,FALSE)*VLOOKUP(E39,Lookup!$G$3:$H$22,2,FALSE)+VLOOKUP(F39,Lookup!$I$3:$J$22,2,FALSE)))","v":""}]
["R38",null,null,null,null,null,{"$f":"IF(D40=\"\",\"\",(VLOOKUP(D40,Lookup!$E$3:$F$22,2,FALSE)*VLOOKUP(E40,Lookup!$G$3:$H$22,2,FALSE)+VLOOKUP(F40,Lookup!$I$3:$J$22,2,FALSE)))","v":""}]
["R39",null,null,null,null,null,{"$f":"IF(D41=\"\",\"\",(VLOOKUP(D41,Lookup!$E$3:$F$22,2,FALSE)*VLOOKUP(E41,Lookup!$G$3:$H$22,2,FALSE)+VLOOKUP(F41,Lookup!$I$3:$J$22,2,FALSE)))","v":""}]
["R40",null,null,null,null,null,{"$f":"IF(D42=\"\",\"\",(VLOOKUP(D42,Lookup!$E$3:$F$22,2,FALSE)*VLOOKUP(E42,Lookup!$G$3:$H$22,2,FALSE)+VLOOKUP(F42,Lookup!$I$3:$J$22,2,FALSE)))","v":""}]
["R41",null,null,null,null,null,{"$f":"IF(D43=\"\",\"\",(VLOOKUP(D43,Lookup!$E$3:$F$22,2,FALSE)*VLOOKUP(E43,Lookup!$G$3:$H$22,2,FALSE)+VLOOKUP(F43,Lookup!$I$3:$J$22,2,FALSE)))","v":""}]
["R42",null,null,null,null,null,{"$f":"IF(D44=\"\",\"\",(VLOOKUP(D44,Lookup!$E$3:$F$22,2,FALSE)*VLOOKUP(E44,Lookup!$G$3:$H$22,2,FALSE)+VLOOKUP(F44,Lookup!$I$3:$J$22,2,FALSE)))","v":""}]
["R43",null,null,null,null,null,{"$f":"IF(D45=\"\",\"\",(VLOOKUP(D45,Lookup!$E$3:$F$22,2,FALSE)*VLOOKUP(E45,Lookup!$G$3:$H$22,2,FALSE)+VLOOKUP(F45,Lookup!$I$3:$J$22,2,FALSE)))","v":""}]
["R44",null,null,null,null,null,{"$f":"IF(D46=\"\",\"\",(VLOOKUP(D46,Lookup!$E$3:$F$22,2,FALSE)*VLOOKUP(E46,Lookup!$G$3:$H$22,2,FALSE)+VLOOKUP(F46,Lookup!$I$3:$J$22,2,FALSE)))","v":""}]
["R45",null,null,null,null,null,{"$f":"IF(D47=\"\",\"\",(VLOOKUP(D47,Lookup!$E$3:$F$22,2,FALSE)*VLOOKUP(E47,Lookup!$G$3:$H$22,2,FALSE)+VLOOKUP(F47,Lookup!$I$3:$J$22,2,FALSE)))","v":""}]
["R46",null,null,null,null,null,{"$f":"IF(D48=\"\",\"\",(VLOOKUP(D48,Lookup!$E$3:$F$22,2,FALSE)*VLOOKUP(E48,Lookup!$G$3:$H$22,2,FALSE)+VLOOKUP(F48,Lookup!$I$3:$J$22,2,FALSE)))","v":""}]
["R47",null,null,null,null,null,{"$f":"IF(D49=\"\",\"\",(VLOOKUP(D49,Lookup!$E$3:$F$22,2,FALSE)*VLOOKUP(E49,Lookup!$G$3:$H$22,2,FALSE)+VLOOKUP(F49,Lookup!$I$3:$J$22,2,FALSE)))","v":""}]
["R48",null,null,null,null,null,{"$f":"IF(D50=\"\",\"\",(VLOOKUP(D50,Lookup!$E$3:$F$22,2,FALSE)*VLOOKUP(E50,Lookup!$G$3:$H$22,2,FALSE)+VLOOKUP(F50,Lookup!$I$3:$J$22,2,FALSE)))","v":""}]
["R49",null,null,null,null,null,{"$f":"IF(D51=\"\",\"\",(VLOOKUP(D51,Lookup!$E$3:$F$22,2,FALSE)*VLOOKUP(E51,Lookup!$G$3:$H$22,2,FALSE)+VLOOKUP(F51,Lookup!$I$3:$J$22,2,FALSE)))","v":""}]
["R50",null,null,null,null,null,{"$f":"IF(D52=\"\",\"\",(VLOOKUP(D52,Lookup!$E$3:$F$22,2,FALSE)*VLOOKUP(E52,Lookup!$G$3:$H$22,2,FALSE)+VLOOKUP(F52,Lookup!$I$3:$J$22,2,FALSE)))","v":""}]
["R51",null,null,null,null,null,{"$f":"IF(D53=\"\",\"\",(VLOOKUP(D53,Lookup!$E$3:$F$22,2,FALSE)*VLOOKUP(E53,Lookup!$G$3:$H$22,2,FALSE)+VLOOKUP(F53,Lookup!$I$3:$J$22,2,FALSE)))","v":""}]
["R52",null,null,null,null,null,{"$f":"IF(D54=\"\",\"\",(VLOOKUP(D54,Lookup!$E$3:$F$22,2,FALSE)*VLOOKUP(E54,Lookup!$G$3:$H$22,2,FALSE)+VLOOKUP(F54,Lookup!$I$3:$J$22,2,FALSE)))","v":""}]
["R53",null,null,null,null,null,{"$f":"IF(D55=\"\",\"\",(VLOOKUP(D55,Lookup!$E$3:$F$22,2,FALSE)*VLOOKUP(E55,Lookup!$G$3:$H$22,2,FALSE)+VLOOKUP(F55,Lookup!$I$3:$J$22,2,FALSE)))","v":""}]
["R54",null,null,null,null,null,{"$f":"IF(D56=\"\",\"\",(VLOOKUP(D56,Lookup!$E$3:$F$22,2,FALSE)*VLOOKUP(E56,Lookup!$G$3:$H$22,2,FALSE)+VLOOKUP(F56,Lookup!$I$3:$J$22,2,FALSE)))","v":""}]
["R55",null,null,null,null,null,{"$f":"IF(D57=\"\",\"\",(VLOOKUP(D57,Lookup!$E$3:$F$22,2,FALSE)*VLOOKUP(E57,Lookup!$G$3:$H$22,2,FALSE)+VLOOKUP(F57,Lookup!$I$3:$J$22,2,FALSE)))","v":""}]
["R56",null,null,null,null,null,{"$f":"IF(D58=\"\",\"\",(VLOOKUP(D58,Lookup!$E$3:$F$22,2,FALSE)*VLOOKUP(E58,Lookup!$G$3:$H$22,2,FALSE)+VLOOKUP(F58,Lookup!$I$3:$J$22,2,FALSE)))","v":""}]
["R57",null,null,null,null,null,{"$f":"IF(D59=\"\",\"\",(VLOOKUP(D59,Lookup!$E$3:$F$22,2,FALSE)*VLOOKUP(E59,Lookup!$G$3:$H$22,2,FALSE)+VLOOKUP(F59,Lookup!$I$3:$J$22,2,FALSE)))","v":""}]
["R58",null,null,null,null,null,{"$f":"IF(D60=\"\",\"\",(VLOOKUP(D60,Lookup!$E$3:$F$22,2,FALSE)*VLOOKUP(E60,Lookup!$G$3:$H$22,2,FALSE)+VLOOKUP(F60,Lookup!$I$3:$J$22,2,FALSE)))","v":""}]
["R59",null,null,null,null,null,{"$f":"IF(D61=\"\",\"\",(VLOOKUP(D61,Lookup!$E$3:$F$22,2,FALSE)*VLOOKUP(E61,Lookup!$G$3:$H$22,2,FALSE)+VLOOKUP(F61,Lookup!$I$3:$J$22,2,FALSE)))","v":""}]
["R60",null,null,null,null,null,{"$f":"IF(D62=\"\",\"\",(VLOOKUP(D62,Lookup!$E$3:$F$22,2,FALSE)*VLOOKUP(E62,Lookup!$G$3:$H$22,2,FALSE)+VLOOKUP(F62,Lookup!$I$3:$J$22,2,FALSE)))","v":""}]
["R61",null,null,null,null,null,{"$f":"IF(D63=\"\",\"\",(VLOOKUP(D63,Lookup!$E$3:$F$22,2,FALSE)*VLOOKUP(E63,Lookup!$G$3:$H$22,2,FALSE)+VLOOKUP(F63,Lookup!$I$3:$J$22,2,FALSE)))","v":""}]
["R62",null,null,null,null,null,{"$f":"IF(D64=\"\",\"\",(VLOOKUP(D64,Lookup!$E$3:$F$22,2,FALSE)*VLOOKUP(E64,Lookup!$G$3:$H$22,2,FALSE)+VLOOKUP(F64,Lookup!$I$3:$J$22,2,FALSE)))","v":""}]
["R63",null,null,null,null,null,{"$f":"IF(D65=\"\",\"\",(VLOOKUP(D65,Lookup!$E$3:$F$22,2,FALSE)*VLOOKUP(E65,Lookup!$G$3:$H$22,2,FALSE)+VLOOKUP(F65,Lookup!$I$3:$J$22,2,FALSE)))","v":""}]
["R64",null,null,null,null,null,{"$f":"IF(D66=\"\",\"\",(VLOOKUP(D66,Lookup!$E$3:$F$22,2,FALSE)*VLOOKUP(E66,Lookup!$G$3:$H$22,2,FALSE)+VLOOKUP(F66,Lookup!$I$3:$J$22,2,FALSE)))","v":""}]
["R65",null,null,null,null,null,{"$f":"IF(D67=\"\",\"\",(VLOOKUP(D67,Lookup!$E$3:$F$22,2,FALSE)*VLOOKUP(E67,Lookup!$G$3:$H$22,2,FALSE)+VLOOKUP(F67,Lookup!$I$3:$J$22,2,FALSE)))","v":""}]
["R66",null,null,null,null,null,{"$f":"IF(D68=\"\",\"\",(VLOOKUP(D68,Lookup!$E$3:$F$22,2,FALSE)*VLOOKUP(E68,Lookup!$G$3:$H$22,2,FALSE)+VLOOKUP(F68,Lookup!$I$3:$J$22,2,FALSE)))","v":""}]
["R67",null,null,null,null,null,{"$f":"IF(D69=\"\",\"\",(VLOOKUP(D69,Lookup!$E$3:$F$22,2,FALSE)*VLOOKUP(E69,Lookup!$G$3:$H$22,2,FALSE)+VLOOKUP(F69,Lookup!$I$3:$J$22,2,FALSE)))","v":""}]
["R68",null,null,null,null,null,{"$f":"IF(D70=\"\",\"\",(VLOOKUP(D70,Lookup!$E$3:$F$22,2,FALSE)*VLOOKUP(E70,Lookup!$G$3:$H$22,2,FALSE)+VLOOKUP(F70,Lookup!$I$3:$J$22,2,FALSE)))","v":""}]
["R69",null,null,null,null,null,{"$f":"IF(D71=\"\",\"\",(VLOOKUP(D71,Lookup!$E$3:$F$22,2,FALSE)*VLOOKUP(E71,Lookup!$G$3:$H$22,2,FALSE)+VLOOKUP(F71,Lookup!$I$3:$J$22,2,FALSE)))","v":""}]
["R70",null,null,null,null,null,{"$f":"IF(D72=\"\",\"\",(VLOOKUP(D72,Lookup!$E$3:$F$22,2,FALSE)*VLOOKUP(E72,Lookup!$G$3:$H$22,2,FALSE)+VLOOKUP(F72,Lookup!$I$3:$J$22,2,FALSE)))","v":""}]
["R71",null,null,null,null,null,{"$f":"IF(D73=\"\",\"\",(VLOOKUP(D73,Lookup!$E$3:$F$22,2,FALSE)*VLOOKUP(E73,Lookup!$G$3:$H$22,2,FALSE)+VLOOKUP(F73,Lookup!$I$3:$J$22,2,FALSE)))","v":""}]
["R72",null,null,null,null,null,{"$f":"IF(D74=\"\",\"\",(VLOOKUP(D74,Lookup!$E$3:$F$22,2,FALSE)*VLOOKUP(E74,Lookup!$G$3:$H$22,2,FALSE)+VLOOKUP(F74,Lookup!$I$3:$J$22,2,FALSE)))","v":""}]
["R73",null,null,null,null,null,{"$f":"IF(D75=\"\",\"\",(VLOOKUP(D75,Lookup!$E$3:$F$22,2,FALSE)*VLOOKUP(E75,Lookup!$G$3:$H$22,2,FALSE)+VLOOKUP(F75,Lookup!$I$3:$J$22,2,FALSE)))","v":""}]
["R74",null,null,null,null,null,{"$f":"IF(D76=\"\",\"\",(VLOOKUP(D76,Lookup!$E$3:$F$22,2,FALSE)*VLOOKUP(E76,Lookup!$G$3:$H$22,2,FALSE)+VLOOKUP(F76,Lookup!$I$3:$J$22,2,FALSE)))","v":""}]
["R75",null,null,null,null,null,{"$f":"IF(D77=\"\",\"\",(VLOOKUP(D77,Lookup!$E$3:$F$22,2,FALSE)*VLOOKUP(E77,Lookup!$G$3:$H$22,2,FALSE)+VLOOKUP(F77,Lookup!$I$3:$J$22,2,FALSE)))","v":""}]
["R76",null,null,null,null,null,{"$f":"IF(D78=\"\",\"\",(VLOOKUP(D78,Lookup!$E$3:$F$22,2,FALSE)*VLOOKUP(E78,Lookup!$G$3:$H$22,2,FALSE)+VLOOKUP(F78,Lookup!$I$3:$J$22,2,FALSE)))","v":""}]
["R77",null,null,null,null,null,{"$f":"IF(D79=\"\",\"\",(VLOOKUP(D79,Lookup!$E$3:$F$22,2,FALSE)*VLOOKUP(E79,Lookup!$G$3:$H$22,2,FALSE)+VLOOKUP(F79,Lookup!$I$3:$J$22,2,FALSE)))","v":""}]
["R78",null,null,null,null,null,{"$f":"IF(D80=\"\",\"\",(VLOOKUP(D80,Lookup!$E$3:$F$22,2,FALSE)*VLOOKUP(E80,Lookup!$G$3:$H$22,2,FALSE)+VLOOKUP(F80,Lookup!$I$3:$J$22,2,FALSE)))","v":""}]
{"$rows_left_out":122}
{"sheet":"4 - Software Install Log","index":4,"n_rows":6,"n_cols":19,"rows_kept":6,"cut":false,"hidden":false,"merged":[[5,0,5,1],[4,0,4,1],[2,0,2,1],[3,0,3,1],[5,7,5,8],[4,7,4,8],[4,9,4,12],[5,9,5,12],[4,14,4,15],[5,14,5,15],[0,3,0,5],[2,2,2,5],[3,2,3,5],[4,2,4,5],[5,2,5,5],[0,10,0,12],[2,7,2,8],[2,9,2,12],[3,7,3,8],[3,9,3,12],[5,16,5,19],[0,17,0,19],[2,14,2,15],[2,16,2,19],[3,14,3,15],[3,16,3,19],[4,16,4,19]]}
["Device ID: ",null,"Location:",null,null,null,null,"Device ID: ",null,"Location:",null,null,null,null,"Device ID: ",null,"Location:"]
["Installed date:",null,"Installed by:",null,"Install type:",null,null,"Installed date:",null,"Installed by:",null,"Install type:",null,null,"Installed date:",null,"Installed by:",null,"Install type:"]
["Software/drivers installed",null,null,null,null,null,null,"Software/drivers installed",null,null,null,null,null,null,"Software/drivers installed"]
["Installation notes",null,null,null,null,null,null,"Installation notes",null,null,null,null,null,null,"Installation notes"]
["Vulnerabilities notes",null,null,null,null,null,null,"Vulnerabilities notes",null,null,null,null,null,null,"Vulnerabilities notes"]
["Recommended actions",null,null,null,null,null,null,"Recommended actions",null,null,null,null,null,null,"Recommended actions"]

{"sheet":"Lookup","index":5,"n_rows":23,"n_cols":21,"rows_kept":23,"cut":false,"hidden":true,"merged":[[2,0,21,0]]}
["ID","Lookup1","Lookup2","Lookup3","Lookup4","Lookup5","Lookup6","Lookup7","Lookup8","Lookup9","Lookup10","Lookup11","Lookup12","Lookup13","Lookup14","Lookup15","Lookup16","Lookup17","Lookup18","Lookup19","Lookup20"]
["Name","Yes/No","Type","IP Address Assignment","Probability","Probability Rating","Impact ","Impact Rating","Proximity","Proximity Rating","Action Status","Lookup11","Lookup12","Lookup13","Lookup14","Lookup15","Lookup16","Lookup17","Lookup18","Lookup19","Lookup20"]
["ELEMENTS","Yes/No","Server","DHCP","Probable",5,"Catastrophic",5,"Immediate",8,"Open","Lookup11","Lookup12","Lookup13","Lookup14","Lookup15","Lookup16","Lookup17","Lookup18","Lookup19","Lookup20"]
[null,"No","SAN","Manual","Likely",4,"High",4,"< 2 weeks",7,"Closed"]
[null,"N/A","Desktop",null,"Possible",3,"Medium",3,"<= 1 Month",6]
[null,null,"Laptop",null,"Unlikely",2,"Low",2,"<= 2 Months",5]
[null,null,"Smartphone",null,"Negligible",1,"Negligible",1,"<= 3 Months",4]
[null,null,"Tablet",null,null,null,null,null,"<= 4 Months",3]
[null,null,"Network Switch",null,null,null,null,null,"<= 5 Months",2]
[null,null,null,null,null,null,null,null,">= 6 Months",1]
[]
[]
[]
[]
[]
[]
[]
[]
[]
[]
[]
[]
["TEST"]